[ubuntu] broken kernel upgrades in 16.04 linux kernel architecture pdf

[ubuntu] broken kernel upgrades in 16.04 linux kernel architecture pdf Couldn’t find any package whose name or description matched “calibre*” Couldn’t find any package whose name or description matched “calibre*” The following partially installed packages will be configured: grub-pc linux-generic linux-image-4.4.0-28-generic linux-image-4.4.0-31-generic linux-image-extra-4.4.0-28-generic linux-image-extra-4.4.0-31-generic linux-image-generic 0 packages upgraded, 0 newly installed, 0 to remove and 0 not upgraded. Need to get 0 B/57.6 MB of archives. Update kernel linux After unpacking 0 B will be used. /var/lib/dpkg/info/grub-pc.config: 26: /etc/default/grub: Syntax error: newline unexpected subprocess installed post-installation script returned error exit


status 2 update-initramfs: deferring update (hook will be called later) run-parts: executing /etc/kernel/postinst.

d/apt-auto-removal 4.4.0-31-generic /boot/vmlinuz-4.4.0-31-generic run-parts: executing /etc/kernel/postinst.d/dkms 4.4.0-31-generic /boot/vmlinuz-4.4.0-31-generic run-parts: executing /etc/kernel/postinst.d/initramfs-tools 4.4.0-31-generic /boot/vmlinuz-4.4.0-31-generic update-initramfs: Generating /boot/initrd.

img-4.4.0-31-generic run-parts: executing /etc/kernel/postinst.d/pm-utils 4.4.0-31-generic /boot/vmlinuz-4.4.0-31-generic run-parts: executing /etc/kernel/postinst.d/unattended-upgrades 4.4.0-31-generic /boot/vmlinuz-4.4.0-31-generic run-parts: executing /etc/kernel/postinst.

d/update-notifier 4.4.0-31-generic /boot/vmlinuz-4.4.0-31-generic run-parts: executing /etc/kernel/postinst.d/zz-update-grub 4.4.0-31-generic /boot/vmlinuz-4.4.0-31-generic /usr/sbin/grub-mkconfig: 26: /etc/default/grub: Syntax error: newline unexpected run-parts: /etc/kernel/postinst.

d/zz-update-grub exited with return code 2 Failed to process /etc/kernel/postinst.d at /var/lib/dpkg/info/linux-image-4.4.0-31-generic.postinst line 1052.

dpkg: error processing package linux-image-4.4.0-31-generic (–configure): subprocess installed post-installation script returned error exit status 2 dpkg: dependency problems prevent configuration of linux-image-extra-4.4.0-31-generic: linux-image-extra-4.4.0-31-generic depends on linux-image-4.4.0-31-generic; however: dpkg: error processing package linux-image-extra-4.4.0-31-generic (–configure): dpkg: dependency problems prevent configuration of linux-image-generic: linux-image-generic depends on linux-image-4.4.0-31-generic; however: linux-image-generic depends on linux-image-extra-4.4.0-31-generic; however: No apport report written because the error message indicates its a followup error from a previous failure. No apport report written because MaxReports is reached already Package linux-image-extra-4.4.0-31-generic is not configured yet. dpkg: error processing package linux-image-generic (–configure): dpkg: dependency problems prevent configuration of linux-generic: linux-generic depends on linux-image-generic (= 4.4.0.31.33); however: dpkg: error processing package linux-image-4.4.0-22-generic (–configure): package linux-image-4.4.0-22-generic is not ready for configuration No apport report written because MaxReports is reached already No apport report written because MaxReports is reached already update-initramfs: deferring update (hook will be called later) run-parts: executing /etc/kernel/postinst.d/apt-auto-removal 4.4.0-28-generic /boot/vmlinuz-4.4.0-28-generic run-parts: executing /etc/kernel/postinst.

d/dkms 4.4.0-28-generic /boot/vmlinuz-4.4.0-28-generic run-parts: executing /etc/kernel/postinst.d/initramfs-tools 4.4.0-28-generic /boot/vmlinuz-4.4.0-28-generic update-initramfs: Generating /boot/initrd.

img-4.4.0-28-generic run-parts: executing /etc/kernel/postinst.d/pm-utils 4.4.0-28-generic /boot/vmlinuz-4.4.0-28-generic run-parts: executing /etc/kernel/postinst.d/unattended-upgrades 4.4.0-28-generic /boot/vmlinuz-4.4.0-28-generic run-parts: executing /etc/kernel/postinst.d/update-notifier 4.4.0-28-generic /boot/vmlinuz-4.4.0-28-generic run-parts: executing /etc/kernel/postinst.

d/zz-update-grub 4.4.0-28-generic /boot/vmlinuz-4.4.0-28-generic /usr/sbin/grub-mkconfig: 26: /etc/default/grub: Syntax error: newline unexpected run-parts: /etc/kernel/postinst.d/zz-update-grub exited with return code 2 Failed to process /etc/kernel/postinst.d at /var/lib/dpkg/info/linux-image-4.4.0-28-generic.

postinst line 1052. dpkg: error processing package linux-image-4.4.0-28-generic (–configure): subprocess installed post-installation script returned error exit status 2 No apport report written because MaxReports is reached already dpkg: error processing package linux-image-extra-4.4.0-22-generic (–configure): package linux-image-extra-4.4.0-22-generic is not ready for configuration dpkg: dependency problems prevent configuration of linux-image-extra-4.4.0-28-generic: linux-image-extra-4.4.0-28-generic depends on linux-image-4.4.0-28-generic; however: dpkg: error processing package linux-image-extra-4.4.0-28-generic (–configure): No apport report written because MaxReports is reached already No apport report written because MaxReports is reached already Failed to perform requested operation on package.

Linux kernel programming for beginners pdf Trying to recover: /var/lib/dpkg/info/grub-pc.config: 26: /etc/default/grub: Syntax error: newline unexpected subprocess installed post-installation script returned error exit status 2 update-initramfs: deferring update (hook will be called later) run-parts: executing /etc/kernel/postinst.d/apt-auto-removal 4.4.0-31-generic /boot/vmlinuz-4.4.0-31-generic run-parts: executing /etc/kernel/postinst.d/dkms 4.4.0-31-generic /boot/vmlinuz-4.4.0-31-generic run-parts: executing /etc/kernel/postinst.

d/initramfs-tools 4.4.0-31-generic /boot/vmlinuz-4.4.0-31-generic update-initramfs: Generating /boot/initrd.img-4.4.0-31-generic run-parts: executing /etc/kernel/postinst.d/pm-utils 4.4.0-31-generic /boot/vmlinuz-4.4.0-31-generic run-parts: executing /etc/kernel/postinst.d/unattended-upgrades 4.4.0-31-generic /boot/vmlinuz-4.4.0-31-generic run-parts: executing /etc/kernel/postinst.

d/update-notifier 4.4.0-31-generic /boot/vmlinuz-4.4.0-31-generic run-parts: executing /etc/kernel/postinst.d/zz-update-grub 4.4.0-31-generic /boot/vmlinuz-4.4.0-31-generic /usr/sbin/grub-mkconfig: 26: /etc/default/grub: Syntax error: newline unexpected run-parts: /etc/kernel/postinst.

d/zz-update-grub exited with return code 2 Failed to process /etc/kernel/postinst.d at /var/lib/dpkg/info/linux-image-4.4.0-31-generic.postinst line 1052. dpkg: error processing package linux-image-4.4.0-31-generic (–configure): subprocess installed post-installation script returned error exit status 2 update-initramfs: deferring update (hook will be called later) run-parts: executing /etc/kernel/postinst.

d/apt-auto-removal 4.4.0-28-generic /boot/vmlinuz-4.4.0-28-generic run-parts: executing /etc/kernel/postinst.d/dkms 4.4.0-28-generic /boot/vmlinuz-4.4.0-28-generic run-parts: executing /etc/kernel/postinst.

d/initramfs-tools 4.4.0-28-generic /boot/vmlinuz-4.4.0-28-generic update-initramfs: Generating /boot/initrd.img-4.4.0-28-generic run-parts: executing /etc/kernel/postinst.

d/pm-utils 4.4.0-28-generic /boot/vmlinuz-4.4.0-28-generic run-parts: executing /etc/kernel/postinst.d/unattended-upgrades 4.4.0-28-generic /boot/vmlinuz-4.4.0-28-generic run-parts: executing /etc/kernel/postinst.d/update-notifier 4.4.0-28-generic /boot/vmlinuz-4.4.0-28-generic run-parts: executing /etc/kernel/postinst.d/zz-update-grub 4.4.0-28-generic /boot/vmlinuz-4.4.0-28-generic /usr/sbin/grub-mkconfig: 26: /etc/default/grub: Syntax error: newline unexpected run-parts: /etc/kernel/postinst.

d/zz-update-grub exited with return code 2 Failed to process /etc/kernel/postinst.d at /var/lib/dpkg/info/linux-image-4.4.0-28-generic.postinst line 1052. dpkg: error processing package linux-image-4.4.0-28-generic (–configure): subprocess installed post-installation script returned error exit status 2 dpkg: dependency problems prevent configuration of linux-image-generic: linux-image-generic depends on linux-image-4.4.0-31-generic; however: dpkg: error processing package linux-image-generic (–configure): dpkg: dependency problems prevent configuration of linux-image-extra-4.4.0-28-generic: linux-image-extra-4.4.0-28-generic depends on linux-image-4.4.0-28-generic; however: dpkg: error processing package linux-image-extra-4.4.0-28-generic (–configure): dpkg: dependency problems prevent configuration of linux-image-extra-4.4.0-31-generic: linux-image-extra-4.4.0-31-generic depends on linux-image-4.4.0-31-generic; however: dpkg: error processing package linux-image-extra-4.4.0-31-generic (–configure): dpkg: dependency problems prevent configuration of linux-generic: linux-generic depends on linux-image-generic (= 4.4.0.31.33); however: 19:31:12 $I have been getting errors like this pretty much any time I attempt to install any application for that matter.

Linux kernel functions This has been an issue for me for months. Linux kernel source code Only today I am sitting down to resolve it. This guide which I found through Google suggests purging my existing kernel, but I can’t: Linux gnosis 4.4.0-24-generic #43-Ubuntu SMP Wed Jun 8 19:27:37 UTC 2016 x86_64 x86_64 x86_64 GNU/LinuxWhat other information can I provide to help you help me trouble shoot this? /var/lib/dpkg/info/grub-pc.config: 26: /etc/default/grub: Syntax error: newline unexpected subprocess installed post-installation script returned error exit status 2What other information can I provide to help you help me trouble shoot this? Thanks for your attention.

There seems to be a syntax error in your /etc/default/grub. Git linux kernel Could you post the contents of that file? I invoked, sudo grub-mkconfig, rebooted, and the sudo apt-get update && sudo apt-get upgrade downloaded and installed the newer kernels no problem. Latest kernel version of linux Thank you Impavidus for directing my attention to the problem with grub in the traceback.

vBulletin ©2000 – 2016, Jelsoft Enterprises Ltd. Linux kernel news Ubuntu Logo, Ubuntu and Canonical © Canonical Ltd. Learn linux kernel Tango Icons © Tango Desktop Project. User contributions on this site are licensed under the Creative Commons Attribution Share Alike 4.0 International License. Linux kernel vger kernel org For details and our forum data attribution, retention and privacy policy, see here Site: https://ubuntuforums.org/showthread.php?t=2333083

banner